
у кого были с этим проблемы, помогите...! сейчас попробую поставить еще раз (предворительно сделав --depclean) и выложу вам сообщения инсталятора....
Модератор: /dev/random
Код: Выделить всё
if /bin/sh ../libtool --mode=compile x86_64-pc-linux-gnu-gcc -DHAVE_CONFIG_H -I. -I. -I.. -D_REENTRANT -DMOD_PATH=\"/usr/lib64/transcode\" -I.. -I../src -I../libac3 -I../avilib -I/usr/include -I../libvo -I../libioaux -I../libxio -I/usr/include/avifile-0.7 -I/usr/include -I/usr/include/lqt -Wall -D_LARGEFILE_SOURCE -D_LARGEFILE64_SOURCE -D_FILE_OFFSET_BITS=64 -march=k8 -pipe -O2 -DDCT_YUV_PRECISION=1 -MT export_ffmpeg.lo -MD -MP -MF ".deps/export_ffmpeg.Tpo" -c -o export_ffmpeg.lo export_ffmpeg.c; \
then mv -f ".deps/export_ffmpeg.Tpo" ".deps/export_ffmpeg.Plo"; else rm -f ".deps/export_ffmpeg.Tpo"; exit 1; fi
x86_64-pc-linux-gnu-gcc -DHAVE_CONFIG_H -I. -I. -I.. -D_REENTRANT -DMOD_PATH=\"/usr/lib64/transcode\" -I.. -I../src -I../libac3 -I../avilib -I/usr/include -I../libvo -I../libioaux -I../libxio -I/usr/include/avifile-0.7 -I/usr/include -I/usr/include/lqt -Wall -D_LARGEFILE_SOURCE -D_LARGEFILE64_SOURCE -D_FILE_OFFSET_BITS=64 -march=k8 -pipe -O2 -DDCT_YUV_PRECISION=1 -MT export_ffmpeg.lo -MD -MP -MF .deps/export_ffmpeg.Tpo -c export_ffmpeg.c -fPIC -DPIC -o .libs/export_ffmpeg.o
export_ffmpeg.c: In function `export_ffmpeg_init':
export_ffmpeg.c:677: error: structure has no member named `frame_rate'
export_ffmpeg.c:678: error: structure has no member named `frame_rate_base'
export_ffmpeg.c:681: error: structure has no member named `frame_rate'
export_ffmpeg.c:682: error: structure has no member named `frame_rate_base'
export_ffmpeg.c:685: error: structure has no member named `frame_rate'
export_ffmpeg.c:686: error: structure has no member named `frame_rate_base'
export_ffmpeg.c:689: error: structure has no member named `frame_rate'
export_ffmpeg.c:690: error: structure has no member named `frame_rate_base'
export_ffmpeg.c:693: error: structure has no member named `frame_rate'
export_ffmpeg.c:694: error: structure has no member named `frame_rate_base'
export_ffmpeg.c:697: error: structure has no member named `frame_rate'
export_ffmpeg.c:698: error: structure has no member named `frame_rate_base'
export_ffmpeg.c:701: error: structure has no member named `frame_rate'
export_ffmpeg.c:702: error: structure has no member named `frame_rate_base'
export_ffmpeg.c:705: error: structure has no member named `frame_rate'
export_ffmpeg.c:706: error: structure has no member named `frame_rate_base'
export_ffmpeg.c:712: error: structure has no member named `frame_rate'
export_ffmpeg.c:713: error: structure has no member named `frame_rate_base'
export_ffmpeg.c:717: error: structure has no member named `frame_rate'
export_ffmpeg.c:718: error: structure has no member named `frame_rate_base'
export_ffmpeg.c:735: error: structure has no member named `frame_rate'
export_ffmpeg.c:736: error: structure has no member named `frame_rate_base'
export_ffmpeg.c:739: error: structure has no member named `frame_rate'
export_ffmpeg.c:740: error: structure has no member named `frame_rate_base'
export_ffmpeg.c:743: error: structure has no member named `frame_rate'
export_ffmpeg.c:744: error: structure has no member named `frame_rate_base'
export_ffmpeg.c:747: error: structure has no member named `frame_rate'
export_ffmpeg.c:748: error: structure has no member named `frame_rate_base'
export_ffmpeg.c:751: error: structure has no member named `frame_rate'
export_ffmpeg.c:752: error: structure has no member named `frame_rate_base'
export_ffmpeg.c:755: error: structure has no member named `frame_rate'
export_ffmpeg.c:756: error: structure has no member named `frame_rate_base'
export_ffmpeg.c:759: error: structure has no member named `frame_rate'
export_ffmpeg.c:760: error: structure has no member named `frame_rate_base'
export_ffmpeg.c:763: error: structure has no member named `frame_rate'
export_ffmpeg.c:764: error: structure has no member named `frame_rate_base'
make[2]: *** [export_ffmpeg.lo] Ошибка 1
make[2]: Leaving directory `/var/tmp/portage/transcode-0.6.14-r2/work/transcode-0.6.14/export'
make[1]: *** [all-recursive] Ошибка 1
make[1]: Leaving directory `/var/tmp/portage/transcode-0.6.14-r2/work/transcode-0.6.14'
make: *** [all] Ошибка 2
!!! ERROR: media-video/transcode-0.6.14-r2 failed.
!!! Function src_compile, Line 132, Exitcode 2
!!! emake failed
!!! If you need support, post the topmost build error, NOT this status message.