Грабли ощутились лбом при установке tkabber-0.9.9.tar.gz на Слак11...
README гласит:
From the shell, you can invoke _Tkabber_ as:
% tkabber.tcl
Начто консоль отвечает:
Error in startup script: can't find package uri 1.0
while executing
"package require uri 1.0"
(file "./jabberlib-tclxml/tclxml/sgmlparser.tcl" line 39)
invoked from within
"source ./jabberlib-tclxml/tclxml/sgmlparser.tcl"
("package ifneeded" script)
invoked from within
"package require -exact sgmlparser 1.0"
(file "./jabberlib-tclxml/tclxml/tclparser-8.1.tcl" line 41)
invoked from within
"source ./jabberlib-tclxml/tclxml/tclparser-8.1.tcl"
("package ifneeded" script)
invoked from within
"package require -exact xml::tclparser 2.0"
("package ifneeded" script)
invoked from within
"package require -exact xml 2.0"
invoked from within
"if {![info exists use_external_tclxml] || $use_external_tclxml == 0} {
package require -exact xml 2.0
} else {
package require xml 2.0
}"
(file "./jabberlib-tclxml/jabberlib.tcl" line 69)
invoked from within
"source ./jabberlib-tclxml/jabberlib.tcl"
("package ifneeded" script)
invoked from within
"package require jabberlib 0.8.4"
(file "./tkabber.tcl" line 178)
И был ему установлен пакет uri-2.13.0-i386-1pvm.tgz , чесно стянутый с linuxpackeges.net
На что консоль никак не хочет менять своё сообщение...
cc -O -Ilib -Icommon -I/usr/include -Ih -c lib/c_cbm.c
In file included from /usr/include/sys/stat.h:105,
from lib/c_cbm.c:25:
/usr/include/bits/stat.h:70: error: field `st_atim' has incomplete type
/usr/include/bits/stat.h:71: error: field `st_mtim' has incomplete type
/usr/include/bits/stat.h:72: error: field `st_ctim' has incomplete type
make: *** [lib/c_cbm.o] Ошибка 1
cc -O -Ilib -Icommon -I/usr/include -Ih -c lib/c_cbm.c
In file included from /usr/include/sys/stat.h:105,
from lib/c_cbm.c:25:
/usr/include/bits/stat.h:70: error: field `st_atim' has incomplete type
/usr/include/bits/stat.h:71: error: field `st_mtim' has incomplete type
/usr/include/bits/stat.h:72: error: field `st_ctim' has incomplete type
make: *** [lib/c_cbm.o] Ошибка 1